Reaction Details
TargetPolyamine deacetylase HDAC10
LigandBDBM50015233
Substrate/Competitorn/a
Meas. Tech.ChEMBL_1349603 (CHEMBL3266027)
IC50 4130±n/a nM
Citation Lee, HYTsai, ACChen, MCShen, PJCheng, YCKuo, CCPan, SLLiu, YMLiu, JFYeh, TKWang, JCChang, CYChang, JYLiou, JP Azaindolylsulfonamides, with a more selective inhibitory effect on histone deacetylase 6 activity, exhibit antitumor activity in colorectal cancer HCT116 cells. J Med Chem57:4009-22 (2014) 
 
Polyamine deacetylase HDAC10
Name:Polyamine deacetylase HDAC10
Type:Chromatin regulator; hydrolase; repressor
Mol. Mass.:71431.89
Organism:Homo sapiens (Human)
Description:Q969S8
Residue:669
BDBM50015233
NameBDBM50015233
Synonyms:CHEMBL3262727
TypeSmall organic molecule
Emp. Form.C16H13N3O4S
Mol. Mass.343.357
SMILESONC(=O)\C=C\c1cccc(c1)S(=O)(=O)n1ccc2cccnc12