Reaction Details
TargetHistone deacetylase 6
LigandBDBM50015233
Substrate/Competitorn/a
Meas. Tech.ChEMBL_1349596 (CHEMBL3265665)
IC50 5.2±n/a nM
Citation Lee, HYTsai, ACChen, MCShen, PJCheng, YCKuo, CCPan, SLLiu, YMLiu, JFYeh, TKWang, JCChang, CYChang, JYLiou, JP Azaindolylsulfonamides, with a more selective inhibitory effect on histone deacetylase 6 activity, exhibit antitumor activity in colorectal cancer HCT116 cells. J Med Chem57:4009-22 (2014) 
 
Histone deacetylase 6
Name:Histone deacetylase 6
Type:Chromatin regulator; hydrolase; repressor
Mol. Mass.:131381.51
Organism:Homo sapiens (Human)
Description:Q9UBN7
Residue:1215
BDBM50015233
NameBDBM50015233
Synonyms:CHEMBL3262727
TypeSmall organic molecule
Emp. Form.C16H13N3O4S
Mol. Mass.343.357
SMILESONC(=O)\C=C\c1cccc(c1)S(=O)(=O)n1ccc2cccnc12