Reaction Details
TargetHistone deacetylase 1
LigandBDBM50439674
Substrate/Competitorn/a
Meas. Tech.ChEMBL_1349594 (CHEMBL3265663)
IC50 58±n/a nM
Citation Lee, HYTsai, ACChen, MCShen, PJCheng, YCKuo, CCPan, SLLiu, YMLiu, JFYeh, TKWang, JCChang, CYChang, JYLiou, JP Azaindolylsulfonamides, with a more selective inhibitory effect on histone deacetylase 6 activity, exhibit antitumor activity in colorectal cancer HCT116 cells. J Med Chem57:4009-22 (2014) 
 
Histone deacetylase 1
Name:Histone deacetylase 1
Type:Enzyme
Mol. Mass.:55090.27
Organism:Homo sapiens (Human)
Description:Q13547
Residue:482
BDBM50439674
NameBDBM50439674
Synonyms:RICOLINOSTAT US11207431, Example E US8609678, 2-(diphenylamino)-N-(7-(hydroxyamino)-7-oxoheptyl)pyrimidine-5-carboxamide [26]
TypeSmall organic molecule
Emp. Form.C24H27N5O3
Mol. Mass.433.5029
SMILESONC(=O)CCCCCCNC(=O)c1cnc(nc1)N(c1ccccc1)c1ccccc1