Reaction Details
TargetProteasome subunit beta type-7
LigandBDBM50069989
Substrate/Competitorn/a
Meas. Tech.ChEMBL_1349633 (CHEMBL3266057)
IC50 7.1±n/a nM
Citation Zhang, JCao, JXu, LZhou, YLiu, TLi, JHu, Y Design, synthesis and biological evaluation of novel tripeptidyl epoxyketone derivatives constructed fromß-amino acid as proteasome inhibitors. Bioorg Med Chem22:2955-65 (2014) 
 
Proteasome subunit beta type-7
Name:Proteasome subunit beta type-7
Type:PROTEIN
Mol. Mass.:29968.13
Organism:Homo sapiens (Human)
Description:ChEMBL_106197
Residue:277
BDBM50069989
NameBDBM50069989
Synonyms:(R)-3-methyl-1-((S)-3-phenyl-2-(pyrazine-2-carboxamido)propanamido)butylboronic acid BORTEZOMIB Dipeptidyl boronic acid derivative N-[(1R)-1-(DIHYDROXYBORYL)-3-METHYLBUTYL]-N-(PYRAZIN-2-YLCARBONYL)-L-PHENYLALANINAMIDE Peptidyl boronic acid derivative Velcade | cid_387447
TypeSmall organic molecule
Emp. Form.C19H25BN4O4
Mol. Mass.384.237
SMILESCC(C)C[C@H](NC(=O)[C@H](Cc1ccccc1)NC(=O)c1cnccn1)B(O)O