Reaction Details
TargetTyrosine-protein kinase ITK/TSK
LigandBDBM50015271
Substrate/Competitorn/a
Meas. Tech.ChEMBL_1349759 (CHEMBL3267591)
Ki 0.800000±n/a nM
Citation Pastor, RMBurch, JDMagnuson, SOrtwine, DFChen, YDe La Torre, KDing, XEigenbrot, CJohnson, ALiimatta, MLiu, YShia, SWang, XWu, LCPei, Z Discovery and optimization of indazoles as potent and selective interleukin-2 inducible T cell kinase (ITK) inhibitors. Bioorg Med Chem Lett24:2448-52 (2014) 
 
Tyrosine-protein kinase ITK/TSK
Name:Tyrosine-protein kinase ITK/TSK
Type:Protein
Mol. Mass.:71839.20
Organism:Homo sapiens (Human)
Description:Q08881
Residue:620
BDBM50015271
NameBDBM50015271
Synonyms:CHEMBL3263036
TypeSmall organic molecule
Emp. Form.C22H16N8O
Mol. Mass.408.4154
SMILESO=C(Nc1cnn(Cc2cccc(c2)C#N)c1)c1n[nH]c2cc(ccc12)-c1cn[nH]c1