Reaction Details
TargetP2Y purinoceptor 1
LigandBDBM50435812
Substrate/Competitorn/a
Meas. Tech.ChEMBL_1349774 (CHEMBL3267606)
Ki 7.0±n/a nM
Citation Hu, CHQiao, JXHan, YWang, TCHua, JPrice, LAWu, QShen, HHuang, CSRehfuss, RWexler, RRLam, PY 2-Amino-1,3,4-thiadiazoles in the 7-hydroxy-N-neopentyl spiropiperidine indolinyl series as potent P2Y1 receptor antagonists. Bioorg Med Chem Lett24:2481-5 (2014) 
 
P2Y purinoceptor 1
Name:P2Y purinoceptor 1
Type:Enzyme
Mol. Mass.:42090.25
Organism:Homo sapiens (Human)
Description:P47900
Residue:373
BDBM50435812
NameBDBM50435812
Synonyms:CHEMBL2393201
TypeSmall organic molecule
Emp. Form.C24H21F3N4OS
Mol. Mass.470.51
SMILESCC(C)(C)c1ccccc1Oc1ncccc1Nc1nnc(s1)-c1ccc(cc1)C(F)(F)F