Reaction Details
TargetP2Y purinoceptor 1
LigandBDBM50015289
Substrate/Competitorn/a
Meas. Tech.ChEMBL_1349774 (CHEMBL3267606)
Ki 8.0±n/a nM
Citation Hu, CHQiao, JXHan, YWang, TCHua, JPrice, LAWu, QShen, HHuang, CSRehfuss, RWexler, RRLam, PY 2-Amino-1,3,4-thiadiazoles in the 7-hydroxy-N-neopentyl spiropiperidine indolinyl series as potent P2Y1 receptor antagonists. Bioorg Med Chem Lett24:2481-5 (2014) 
 
P2Y purinoceptor 1
Name:P2Y purinoceptor 1
Type:Enzyme
Mol. Mass.:42090.25
Organism:Homo sapiens (Human)
Description:P47900
Residue:373
BDBM50015289
NameBDBM50015289
Synonyms:CHEMBL3263069 | US9120798, 44
TypeSmall organic molecule
Emp. Form.C37H45N5O3S
Mol. Mass.639.85
SMILESCOC(=O)c1ccc(O)c2N(CC3(CCN(CC(C)(C)C)CC3)c12)c1ccccc1Nc1nnc(s1)-c1ccc(cc1)C(C)(C)C