Reaction Details
TargetP2Y purinoceptor 1
LigandBDBM50015291
Substrate/Competitorn/a
Meas. Tech.ChEMBL_1349775 (CHEMBL3267607)
IC50 0.630000±n/a nM
Citation Hu, CHQiao, JXHan, YWang, TCHua, JPrice, LAWu, QShen, HHuang, CSRehfuss, RWexler, RRLam, PY 2-Amino-1,3,4-thiadiazoles in the 7-hydroxy-N-neopentyl spiropiperidine indolinyl series as potent P2Y1 receptor antagonists. Bioorg Med Chem Lett24:2481-5 (2014) 
 
P2Y purinoceptor 1
Name:P2Y purinoceptor 1
Type:Enzyme
Mol. Mass.:42090.25
Organism:Homo sapiens (Human)
Description:P47900
Residue:373
BDBM50015291
NameBDBM50015291
Synonyms:CHEMBL3263071 | US9120798, 26
TypeSmall organic molecule
Emp. Form.C32H33ClF3N5O2S
Mol. Mass.644.15
SMILESCC(C)(C)CN1CCC2(CN(c3c2c(Cl)ccc3O)c2ccccc2Nc2nnc(s2)-c2ccc(OC(F)(F)F)cc2)CC1