Reaction Details
TargetRuvB-like 1
LigandBDBM50015300
Substrate/Competitorn/a
Meas. Tech.ChEMBL_1349809 (CHEMBL3268010)
IC50 18000±n/a nM
Citation Elkaim, JLamblin, MLaguerre, MRosenbaum, JLestienne, PEloy, LCresteil, TFelpin, FXDessolin, J Design, synthesis and biological evaluation of Pontin ATPase inhibitors through a molecular docking approach. Bioorg Med Chem Lett24:2512-6 (2014) 
 
RuvB-like 1
Name:RuvB-like 1
Type:PROTEIN
Mol. Mass.:50226.43
Organism:Homo sapiens (Human)
Description:ChEMBL_108308
Residue:456
BDBM50015300
NameBDBM50015300
Synonyms:CHEMBL3263108
TypeSmall organic molecule
Emp. Form.C26H22N4O3
Mol. Mass.438.4779
SMILESN[C@@H](Cc1c[nH]c2ccccc12)C(=O)Nc1ccc(cc1)-c1c(O)c2ccccc2[nH]c1=O