Reaction Details
TargetATP-dependent translocase ABCB1
LigandBDBM50015306
Substrate/Competitorn/a
Meas. Tech.ChEMBL_1350312 (CHEMBL3268033)
EC50 27±n/a nM
Citation Singh, SPrasad, NRChufan, EEPatel, BAWang, YJChen, ZSAmbudkar, SVTalele, TT Design and synthesis of human ABCB1 (P-glycoprotein) inhibitors by peptide coupling of diverse chemical scaffolds on carboxyl and amino termini of (S)-valine-derived thiazole amino acid. J Med Chem57:4058-72 (2014) 
 
ATP-dependent translocase ABCB1
Name:ATP-dependent translocase ABCB1
Type:Protein
Mol. Mass.:141503.50
Organism:Homo sapiens (Human)
Description:P08183
Residue:1280
BDBM50015306
NameBDBM50015306
Synonyms:CHEMBL3263842
TypeSmall organic molecule
Emp. Form.C31H31N3O6S
Mol. Mass.573.659
SMILESCOc1cc(cc(OC)c1OC)C(=O)N[C@@H](C(C)C)c1nc(cs1)C(=O)Nc1ccccc1C(=O)c1ccccc1