Reaction Details
TargetSerine/threonine-protein kinase Chk1
LigandBDBM50015314
Substrate/Competitorn/a
Meas. Tech.ChEMBL_1350535 (CHEMBL3270459)
IC50>10000±n/a nM
Citation Lee, YSChuang, SHHuang, LYLai, CLLin, YHYang, JYLiu, CWYang, SCLin, HSChang, CCLai, JYJian, PSLam, KChang, JMLau, JYHuang, JJ Discovery of 4-aryl-N-arylcarbonyl-2-aminothiazoles as Hec1/Nek2 inhibitors. Part I: optimization of in vitro potencies and pharmacokinetic properties. J Med Chem57:4098-110 (2014) 
 
Serine/threonine-protein kinase Chk1
Name:Serine/threonine-protein kinase Chk1
Type:Enzyme Catalytic Domain
Mol. Mass.:54443.02
Organism:Homo sapiens (Human)
Description:gi_166295192
Residue:476
BDBM50015314
NameBDBM50015314
Synonyms:CHEMBL3263869
TypeSmall organic molecule
Emp. Form.C24H20FN3O3S
Mol. Mass.449.497
SMILESCOc1ccc(Oc2cc(C)c(-c3csc(NC(=O)c4ccnc(F)c4)n3)c(C)c2)cc1