Reaction Details
TargetAurora kinase B
LigandBDBM50015314
Substrate/Competitorn/a
Meas. Tech.ChEMBL_1350538 (CHEMBL3270462)
IC50>10000±n/a nM
Citation Lee, YSChuang, SHHuang, LYLai, CLLin, YHYang, JYLiu, CWYang, SCLin, HSChang, CCLai, JYJian, PSLam, KChang, JMLau, JYHuang, JJ Discovery of 4-aryl-N-arylcarbonyl-2-aminothiazoles as Hec1/Nek2 inhibitors. Part I: optimization of in vitro potencies and pharmacokinetic properties. J Med Chem57:4098-110 (2014) 
 
Aurora kinase B
Name:Aurora kinase B
Type:Protein
Mol. Mass.:39327.72
Organism:Homo sapiens (Human)
Description:Q96GD4
Residue:344
BDBM50015314
NameBDBM50015314
Synonyms:CHEMBL3263869
TypeSmall organic molecule
Emp. Form.C24H20FN3O3S
Mol. Mass.449.497
SMILESCOc1ccc(Oc2cc(C)c(-c3csc(NC(=O)c4ccnc(F)c4)n3)c(C)c2)cc1