Reaction Details
TargetVitamin D3 receptor
LigandBDBM50015316
Substrate/Competitorn/a
Meas. Tech.ChEMBL_1350556 (CHEMBL3270480)
IC50 12±n/a nM
Citation Kudo, TIshizawa, MMaekawa, KNakabayashi, MWatarai, YUchida, HTokiwa, HIkura, TIto, NMakishima, MYamada, S Combination of triple bond and adamantane ring on the vitamin D side chain produced partial agonists for vitamin D receptor. J Med Chem57:4073-87 (2014) 
 
Vitamin D3 receptor
Name:Vitamin D3 receptor
Type:Protein
Mol. Mass.:48288.72
Organism:Homo sapiens (Human)
Description:P11473
Residue:427
BDBM50015316
NameBDBM50015316
Synonyms:CHEMBL3263873
TypeSmall organic molecule
Emp. Form.C36H52O3
Mol. Mass.532.7963
SMILES[H][C@@]1([#6]-[#6][C@@]2([H])\[#6](-[#6]-[#6]-[#6][C@]12[#6])=[#6]\[#6]=[#6]-1\[#6]-[#6@@H](-[#8])-[#6](=[#6])-[#6@H](-[#8])-[#6]-1)[#6@H](-[#6])-[#6]C#C[#6@@H](-[#8])-[#6]C12[#6]-[#6]-3-[#6]-[#6](-[#6]-[#6](-[#6]-3)-[#6]1)-[#6]2