Reaction Details
TargetLegumain
LigandBDBM50015353
Substrate/Competitorn/a
Meas. Tech.ChEMBL_1347909 (CHEMBL3267446)
IC50 9.0±n/a nM
Citation Higgins, CBouazzaoui, SGaddale, KD'Costa, ZTempleman, AO'Rourke, MYoung, AScott, CHarrison, TMullan, PWilliams, R P3 SAR exploration of biphenyl carbamate based Legumain inhibitors. Bioorg Med Chem Lett24:2521-4 (2014) 
 
Legumain
Name:Legumain
Type:n/a
Mol. Mass.:49411.12
Organism:Homo sapiens (Human)
Description:n/a
Residue:433
BDBM50015353
NameBDBM50015353
Synonyms:CHEMBL3264583
TypeSmall organic molecule
Emp. Form.C23H23ClN4O4
Mol. Mass.454.906
SMILESNC(=O)C[C@H](NC(=O)[C@@H]1CCCN1C(=O)OCc1ccc(cc1)-c1cccc(Cl)c1)C#N