Reaction Details
TargetBile acid receptor
LigandBDBM50015403
Substrate/Competitorn/a
Meas. Tech.ChEMBL_1348160 (CHEMBL3269919)
IC50 10±n/a nM
Citation Yu, DDLin, WForman, BMChen, T Identification of trisubstituted-pyrazol carboxamide analogs as novel and potent antagonists of farnesoid X receptor. Bioorg Med Chem22:2919-38 (2014) 
 
Bile acid receptor
Name:Bile acid receptor
Type:Nuclear Receptor
Mol. Mass.:55916.24
Organism:Homo sapiens (Human)
Description:Q96RI1
Residue:486
BDBM50015403
NameBDBM50015403
Synonyms:CHEMBL3264636
TypeSmall organic molecule
Emp. Form.C28H27ClN4O4S
Mol. Mass.551.056
SMILESCc1ccc(cc1)-c1nn(cc1C(=O)Nc1ccc(C)c(c1)S(=O)(=O)N1CCOCC1)-c1cccc(Cl)c1