Reaction Details
TargetBile acid receptor
LigandBDBM50015414
Substrate/Competitorn/a
Meas. Tech.ChEMBL_1348160 (CHEMBL3269919)
IC50 18±n/a nM
Citation Yu, DDLin, WForman, BMChen, T Identification of trisubstituted-pyrazol carboxamide analogs as novel and potent antagonists of farnesoid X receptor. Bioorg Med Chem22:2919-38 (2014) 
 
Bile acid receptor
Name:Bile acid receptor
Type:Nuclear Receptor
Mol. Mass.:55916.24
Organism:Homo sapiens (Human)
Description:Q96RI1
Residue:486
BDBM50015414
NameBDBM50015414
Synonyms:CHEMBL3264639
TypeSmall organic molecule
Emp. Form.C29H27N5O4S2
Mol. Mass.573.686
SMILESCc1ccc(cc1)-c1nn(cc1C(=O)Nc1ccc(C)c(c1)S(=O)(=O)N1CCOCC1)-c1nc2ccccc2s1