Reaction Details
TargetProto-oncogene tyrosine-protein kinase receptor Ret
LigandBDBM50015448
Substrate/Competitorn/a
Meas. Tech.ChEMBL_1348203 (CHEMBL3270318)
EC50>1000±n/a nM
Citation Currie, KSKropf, JELee, TBlomgren, PXu, JZhao, ZGallion, SWhitney, JAMaclin, DLansdon, EBMaciejewski, PRossi, AMRong, HMacaluso, JBarbosa, JDi Paolo, JAMitchell, SA Discovery of GS-9973, a selective and orally efficacious inhibitor of spleen tyrosine kinase. J Med Chem57:3856-73 (2014) 
 
Proto-oncogene tyrosine-protein kinase receptor Ret
Name:Proto-oncogene tyrosine-protein kinase receptor Ret
Type:Protein
Mol. Mass.:124318.29
Organism:Homo sapiens (Human)
Description:P07949
Residue:1114
BDBM50015448
NameBDBM50015448
Synonyms:CHEMBL3265032
TypeSmall organic molecule
Emp. Form.C23H21N7O
Mol. Mass.411.4591
SMILESC1CN(CCO1)c1ccc(Nc2nc(cn3ccnc23)-c2ccc3cn[nH]c3c2)cc1