Reaction Details
TargetD(2) dopamine receptor
LigandBDBM50015495
Substrate/Competitorn/a
Meas. Tech.ChEMBL_1348403 (CHEMBL3265956)
Ki 27±n/a nM
Citation Wängler, CChowdhury, SHöfner, GDjurova, PPurisima, EOBartenstein, PWängler, BFricker, GWanner, KTSchirrmacher, R Shuttle-cargo fusion molecules of transport peptides and the hD2/3 receptor antagonist fallypride: a feasible approach to preserve ligand-receptor binding? J Med Chem57:4368-81 (2014) 
 
D(2) dopamine receptor
Name:D(2) dopamine receptor
Type:Cell-surface receptors
Mol. Mass.:50647.10
Organism:Homo sapiens (Human)
Description:P14416
Residue:443
BDBM50015495
NameBDBM50015495
Synonyms:CHEMBL3265041
TypeSmall organic molecule
Emp. Form.C101H140N22O21S2
Mol. Mass.2062.457
SMILESCOc1cc(CCCSC2CC(=O)N(CCCCCC(=O)N[C@@H]([C@@H](C)O)C(=O)N[C@@H](Cc3cnc[nH]3)C(=O)N[C@@H](CCCNC(N)=N)C(=O)N3CCC[C@H]3C(=O)N3CCC[C@H]3C(=O)N[C@@H](CCSC)C(=O)N[C@@H](Cc3c[nH]c4ccccc34)C(=O)N[C@@H](CO)C(=O)N3CCC[C@H]3C(=O)N[C@@H](C(C)C)C(=O)N[C@@H](Cc3c[nH]c4ccccc34)C(=O)N3CCC[C@H]3C(O)=O)C2=O)cc(C(=O)NC[C@@H]2CCCN2CC=C)c1OC