Reaction Details
TargetD(2) dopamine receptor
LigandBDBM50015527
Substrate/Competitorn/a
Meas. Tech.ChEMBL_1348403 (CHEMBL3265956)
Ki 6.0±n/a nM
Citation Wängler, CChowdhury, SHöfner, GDjurova, PPurisima, EOBartenstein, PWängler, BFricker, GWanner, KTSchirrmacher, R Shuttle-cargo fusion molecules of transport peptides and the hD2/3 receptor antagonist fallypride: a feasible approach to preserve ligand-receptor binding? J Med Chem57:4368-81 (2014) 
 
D(2) dopamine receptor
Name:D(2) dopamine receptor
Type:Cell-surface receptors
Mol. Mass.:50647.10
Organism:Homo sapiens (Human)
Description:P14416
Residue:443
BDBM50015527
NameBDBM50015527
Synonyms:CHEMBL3265321
TypeSmall organic molecule
Emp. Form.C104H156FN21O23SSi
Mol. Mass.2147.627
SMILESCC[C@H](C)[C@H](NC(=O)[C@H](C)NC(=O)[C@H](Cc1cnc[nH]1)NC(=O)[C@H](CCCCNC(=O)O\N=C\c1ccc(cc1)[Si](F)(C(C)(C)C)C(C)(C)C)NC(=O)CCOCCOCCOCCOCCNC(=O)CCCCCN1C(=O)CC(SCCCc2cc(OC)c(OC)c(c2)C(=O)NC[C@@H]2CCCN2CC=C)C1=O)C(=O)N[C@@H](Cc1ccc(O)cc1)C(=O)N1CCC[C@H]1C(=O)N[C@@H](CCCNC(N)=N)C(=O)N[C@@H](Cc1cnc[nH]1)C(O)=O