Reaction Details
TargetAldo-keto reductase family 1 member B1
LigandBDBM50015586
Substrate/Competitorn/a
Meas. Tech.ChEMBL_1348878 (CHEMBL3271147)
IC50 85±n/a nM
Citation Ovais, SPushpalatha, HReddy, GBRathore, PBashir, RYaseen, SDheyaa, AYaseen, RTanwar, OAkthar, MSamim, MJaved, K Synthesis and biological evaluation of some new pyrazoline substituted benzenesulfonylurea/thiourea derivatives as anti-hyperglycaemic agents and aldose reductase inhibitors. Eur J Med Chem80:209-17 (2014) 
 
Aldo-keto reductase family 1 member B1
Name:Aldo-keto reductase family 1 member B1
Type:PROTEIN
Mol. Mass.:35797.87
Organism:Rattus norvegicus
Description:ChEMBL_1512484
Residue:316
BDBM50015586
NameBDBM50015586
Synonyms:CHEMBL3260155
TypeSmall organic molecule
Emp. Form.C31H30ClN5O2S2
Mol. Mass.604.185
SMILESCN(C)c1ccc(cc1)C1=NN(C(C1)c1ccccc1Cl)c1ccc(cc1)S(=O)(=O)NC(=S)NCc1ccccc1