Reaction Details
TargetCarbonic anhydrase 1
LigandBDBM81920
Substrate/Competitorn/a
Meas. Tech.ChEMBL_1349989 (CHEMBL3270415)
Ki 5500±n/a nM
Citation Nishimori, IVullo, DMinakuchi, TScozzafava, ACapasso, CSupuran, CT Sulfonamide inhibition studies of twoß-carbonic anhydrases from the bacterial pathogen Legionella pneumophila. Bioorg Med Chem22:2939-46 (2014) 
 
Carbonic anhydrase 1
Name:Carbonic anhydrase 1
Type:Enzyme
Mol. Mass.:28873.37
Organism:Homo sapiens (Human)
Description:P00915
Residue:261
BDBM81920
NameBDBM81920
Synonyms:p-Hydroxy-benzene derivative, 3a
TypeSmall organic molecule
Emp. Form.C6H7NO3S
Mol. Mass.173.19
SMILESNS(=O)(=O)c1ccc(O)cc1