Reaction Details
TargetCyclin-dependent kinase 2/G1/S-specific cyclin-E1
LigandBDBM50016146
Substrate/Competitorn/a
Meas. Tech.ChEMBL_1350156 (CHEMBL3266078)
IC50 1200±n/a nM
Citation Reichelt, ABailis, JMBartberger, MDYao, GShu, HKaller, MRAllen, JGWeidner, MFKeegan, KSDao, JH Synthesis and structure-activity relationship of trisubstituted thiazoles as Cdc7 kinase inhibitors. Eur J Med Chem80:364-82 (2014) 
 
Cyclin-dependent kinase 2/G1/S-specific cyclin-E1
Name:Cyclin-dependent kinase 2/G1/S-specific cyclin-E1
Type:Protein
Mol. Mass.:n/a
Description:n/a
Components:This complex has 2 components.
Component 1
Name:Cyclin-dependent kinase 2
Synonyms:CDK2 CDK2_HUMAN Cell division protein kinase 2 Protein cereblon/Cyclin-dependent kinase 2 | p33 protein kinase
Type:Enzyme Subunit
Mol. Mass.:33938.17
Organism:Homo sapiens (Human)
Description:P24941
Residue:298
Component 2
Name:G1/S-specific cyclin-E1
Synonyms:CCNE CCNE1_HUMAN
Type:Enzyme Subunit
Mol. Mass.:47073.17
Organism:Homo sapiens (Human)
Description:n/a
Residue:410
BDBM50016146
NameBDBM50016146
Synonyms:CHEMBL3261498
TypeSmall organic molecule
Emp. Form.C15H10N4OS
Mol. Mass.294.331
SMILESO=C1Nc2ccccc2Nc2nc(sc12)-c1ccncc1