Reaction Details
TargetNeuronal acetylcholine receptor subunit alpha-7
LigandBDBM50049750
Substrate/Competitorn/a
Meas. Tech.ChEMBL_1348244 (CHEMBL3271113)
Ki 148±n/a nM
Citation Clark, RBLamppu, DLibertine, LMcDonough, AKumar, ALaRosa, GRush, RElbaum, D Discovery of novel 2-((pyridin-3-yloxy)methyl)piperazines asa7 nicotinic acetylcholine receptor modulators for the treatment of inflammatory disorders. J Med Chem57:3966-83 (2014) 
 
Neuronal acetylcholine receptor subunit alpha-7
Name:Neuronal acetylcholine receptor subunit alpha-7
Type:n/a
Mol. Mass.:56448.33
Organism:Homo sapiens (Human)
Description: CHRNA7 (NACHRA7)
Residue:502
BDBM50049750
NameBDBM50049750
Synonyms:(S)-3-(azetidin-2-ylmethoxy)pyridine A-159470 CHEMBL59986
TypeSmall organic molecule
Emp. Form.C9H12N2O
Mol. Mass.164.2044
SMILESC(Oc1cccnc1)[C@@H]1CCN1