Reaction Details
TargetAldo-keto reductase family 1 member B1 [K65Q]
LigandBDBM50049730
Substrate/Competitorn/a
Meas. Tech.ChEMBL_1348462 (CHEMBL3266777)
IC50 170±n/a nM
Citation Maccari, RVitale, RMOttaną, RRocchiccioli, MMarrazzo, ACardile, VGraziano, ACAmodeo, PMura, UDel Corso, A Structure-activity relationships and molecular modelling of new 5-arylidene-4-thiazolidinone derivatives as aldose reductase inhibitors and potential anti-inflammatory agents. Eur J Med Chem81:1-14 (2014) 
 
Aldo-keto reductase family 1 member B1 [K65Q]
Name:Aldo-keto reductase family 1 member B1 [K65Q]
Type:Protein
Mol. Mass.:35916.27
Organism:Bos taurus (Cattle)
Description:P16116[K65Q]
Residue:315
BDBM50049730
NameBDBM50049730
Synonyms:2-(5-(2-methyl-3-phenylallylidene)-4-oxo-2-thioxothiazolidin-3-yl)acetic acid Epalrestat | {5-[(E)-2-Methyl-3-phenyl-prop-2-en-(Z)-ylidene]-4-oxo-2-thioxo-thiazolidin-3-yl}-acetic acid
TypeSmall organic molecule
Emp. Form.C15H13NO3S2
Mol. Mass.319.399
SMILESC\C(\C=C1/SC(=S)N(CC(O)=O)C1=O)=C/c1ccccc1