Reaction Details
TargetAldo-keto reductase family 1 member B1 [K65Q]
LigandBDBM16312
Substrate/Competitorn/a
Meas. Tech.ChEMBL_1348462 (CHEMBL3266777)
IC50 2000±n/a nM
Citation Maccari, RVitale, RMOttaną, RRocchiccioli, MMarrazzo, ACardile, VGraziano, ACAmodeo, PMura, UDel Corso, A Structure-activity relationships and molecular modelling of new 5-arylidene-4-thiazolidinone derivatives as aldose reductase inhibitors and potential anti-inflammatory agents. Eur J Med Chem81:1-14 (2014) 
 
Aldo-keto reductase family 1 member B1 [K65Q]
Name:Aldo-keto reductase family 1 member B1 [K65Q]
Type:Protein
Mol. Mass.:35916.27
Organism:Bos taurus (Cattle)
Description:P16116[K65Q]
Residue:315
BDBM16312
NameBDBM16312
Synonyms:(4S)-6-fluoro-2,3-dihydrospiro[1-benzopyran-4,4'-imidazolidine]-2',5'-dione Sorbinil
TypeSmall organic molecule
Emp. Form.C11H9FN2O3
Mol. Mass.236.1992
SMILESFc1ccc2OCC[C@]3(NC(=O)NC3=O)c2c1