Reaction Details
TargetAldo-keto reductase family 1 member B1 [K65Q]
LigandBDBM50016241
Substrate/Competitorn/a
Meas. Tech.ChEMBL_1348462 (CHEMBL3266777)
IC50 33900±n/a nM
Citation Maccari, RVitale, RMOttaną, RRocchiccioli, MMarrazzo, ACardile, VGraziano, ACAmodeo, PMura, UDel Corso, A Structure-activity relationships and molecular modelling of new 5-arylidene-4-thiazolidinone derivatives as aldose reductase inhibitors and potential anti-inflammatory agents. Eur J Med Chem81:1-14 (2014) 
 
Aldo-keto reductase family 1 member B1 [K65Q]
Name:Aldo-keto reductase family 1 member B1 [K65Q]
Type:Protein
Mol. Mass.:35916.27
Organism:Bos taurus (Cattle)
Description:P16116[K65Q]
Residue:315
BDBM50016241
NameBDBM50016241
Synonyms:CHEMBL3262466
TypeSmall organic molecule
Emp. Form.C13H12N2O5S
Mol. Mass.308.31
SMILESCOc1cc(\C=C2/SC(=O)NC2=O)ccc1OCC(N)=O