Reaction Details
TargetSigma non-opioid intracellular receptor 1
LigandBDBM50035105
Substrate/Competitorn/a
Meas. Tech.ChEMBL_1348487 (CHEMBL3266802)
Ki 17±n/a nM
Citation Bai, SLi, SXu, JPeng, XSai, KChu, WTu, ZZeng, CMach, RH Synthesis and structure-activity relationship studies of conformationally flexible tetrahydroisoquinolinyl triazole carboxamide and triazole substituted benzamide analogues ass2 receptor ligands. J Med Chem57:4239-51 (2014) 
 
Sigma non-opioid intracellular receptor 1
Name:Sigma non-opioid intracellular receptor 1
Type:Enzyme Catalytic Domain
Mol. Mass.:25124.85
Organism:Homo sapiens (Human)
Description:Q99720
Residue:223
BDBM50035105
NameBDBM50035105
Synonyms:1'-{4-[1-(4-fluorophenyl)-1H-3-indolyl]butyl}spiro[1,3-dihydroisobenzofuran-1,4'-(hexahydropyridine)] CHEMBL61479 Siramesine
TypeSmall organic molecule
Emp. Form.C30H31FN2O
Mol. Mass.454.5783
SMILESFc1ccc(cc1)-n1cc(CCCCN2CCC3(CC2)OCc2ccccc32)c2ccccc12