Reaction Details
TargetSigma non-opioid intracellular receptor 1
LigandBDBM50137628
Substrate/Competitorn/a
Meas. Tech.ChEMBL_1348912 (CHEMBL3271543)
Ki 3078±n/a nM
Citation Bai, SLi, SXu, JPeng, XSai, KChu, WTu, ZZeng, CMach, RH Synthesis and structure-activity relationship studies of conformationally flexible tetrahydroisoquinolinyl triazole carboxamide and triazole substituted benzamide analogues ass2 receptor ligands. J Med Chem57:4239-51 (2014) 
 
Sigma non-opioid intracellular receptor 1
Name:Sigma non-opioid intracellular receptor 1
Type:Enzyme Catalytic Domain
Mol. Mass.:25246.51
Organism:Mus musculus (Mouse)
Description:O55242
Residue:223
BDBM50137628
NameBDBM50137628
Synonyms:CHEMBL1830682 N-(4-(6,7-dimethoxy-3,4-dihydroisoquinolin-2(1H)-yl)butyl)-2-methoxy-5-methylbenzamide [3H]-N-(4-(6,7-dimethoxy-3,4-dihydroisoquinolin-2(1H)-yl)butyl)-2-methoxy-5-methylbenzamide
TypeSmall organic molecule
Emp. Form.C24H32N2O4
Mol. Mass.412.5219
SMILESCOc1ccc(C)cc1C(=O)NCCCCN1CCc2cc(OC)c(OC)cc2C1