Reaction Details
TargetSigma non-opioid intracellular receptor 1
LigandBDBM50216055
Substrate/Competitorn/a
Meas. Tech.ChEMBL_1348912 (CHEMBL3271543)
Ki 1300±n/a nM
Citation Bai, SLi, SXu, JPeng, XSai, KChu, WTu, ZZeng, CMach, RH Synthesis and structure-activity relationship studies of conformationally flexible tetrahydroisoquinolinyl triazole carboxamide and triazole substituted benzamide analogues ass2 receptor ligands. J Med Chem57:4239-51 (2014) 
 
Sigma non-opioid intracellular receptor 1
Name:Sigma non-opioid intracellular receptor 1
Type:Enzyme Catalytic Domain
Mol. Mass.:25246.51
Organism:Mus musculus (Mouse)
Description:O55242
Residue:223
BDBM50216055
NameBDBM50216055
Synonyms:CHEMBL387741 | N-[4-(6,7-dimethoxy-3,4-dihydro-1H-isoquinolin-2-yl)-butyl]-2-(2-fluoro-ethoxy)-5-iodo-benzamide
TypeSmall organic molecule
Emp. Form.C24H30FIN2O4
Mol. Mass.556.4089
SMILESCOc1cc2CCN(CCCCNC(=O)c3cc(I)ccc3OCCF)Cc2cc1OC