Reaction Details
TargetSigma non-opioid intracellular receptor 1
LigandBDBM50016274
Substrate/Competitorn/a
Meas. Tech.ChEMBL_1348915 (CHEMBL3271546)
Ki 8082±n/a nM
Citation Bai, SLi, SXu, JPeng, XSai, KChu, WTu, ZZeng, CMach, RH Synthesis and structure-activity relationship studies of conformationally flexible tetrahydroisoquinolinyl triazole carboxamide and triazole substituted benzamide analogues ass2 receptor ligands. J Med Chem57:4239-51 (2014) 
 
Sigma non-opioid intracellular receptor 1
Name:Sigma non-opioid intracellular receptor 1
Type:Protein
Mol. Mass.:25307.17
Organism:Cavia porcellus (Guinea pig)
Description:Q60492
Residue:223
BDBM50016274
NameBDBM50016274
Synonyms:CHEMBL3262525
TypeSmall organic molecule
Emp. Form.C25H31N5O4
Mol. Mass.465.5447
SMILESCOc1cc2CCN(CCCCNC(=O)c3cn(Cc4cccc(O)c4)nn3)Cc2cc1OC