Reaction Details
TargetSigma non-opioid intracellular receptor 1
LigandBDBM50016290
Substrate/Competitorn/a
Meas. Tech.ChEMBL_1348915 (CHEMBL3271546)
Ki 1752±n/a nM
Citation Bai, SLi, SXu, JPeng, XSai, KChu, WTu, ZZeng, CMach, RH Synthesis and structure-activity relationship studies of conformationally flexible tetrahydroisoquinolinyl triazole carboxamide and triazole substituted benzamide analogues ass2 receptor ligands. J Med Chem57:4239-51 (2014) 
 
Sigma non-opioid intracellular receptor 1
Name:Sigma non-opioid intracellular receptor 1
Type:Protein
Mol. Mass.:25307.17
Organism:Cavia porcellus (Guinea pig)
Description:Q60492
Residue:223
BDBM50016290
NameBDBM50016290
Synonyms:CHEMBL3262787
TypeSmall organic molecule
Emp. Form.C32H37N5O4
Mol. Mass.555.6673
SMILESCOc1cccc(Cn2cc(nn2)-c2cccc(c2)C(=O)NCCCCN2CCc3cc(OC)c(OC)cc3C2)c1