Reaction Details
TargetE3 ubiquitin-protein ligase Mdm2
LigandBDBM50016472
Substrate/Competitorn/a
Meas. Tech.ChEMBL_1347757 (CHEMBL3271858)
Ki 280±n/a nM
Citation Zheng, GHShen, JJZhan, YCYi, HXue, STWang, ZJi, XYLi, ZR Design, synthesis and in vitro and in vivo antitumour activity of 3-benzylideneindolin-2-one derivatives, a novel class of small-molecule inhibitors of the MDM2-p53 interaction. Eur J Med Chem81:277-88 (2014) 
 
E3 ubiquitin-protein ligase Mdm2
Name:E3 ubiquitin-protein ligase Mdm2
Type:Oncoprotein
Mol. Mass.:55196.54
Organism:Homo sapiens (Human)
Description:Q00987
Residue:491
BDBM50016472
NameBDBM50016472
Synonyms:CHEMBL3265097
TypeSmall organic molecule
Emp. Form.C21H22ClNO3
Mol. Mass.371.857
SMILESCCCOc1ccc(\C=C2\C(=O)Nc3ccc(Cl)cc23)c(OCCC)c1