Reaction Details
TargetProthrombin
LigandBDBM50016525
Substrate/Competitorn/a
Meas. Tech.ChEMBL_1354674 (CHEMBL3281099)
Ki 4800±n/a nM
Citation Geratz, JDCheng, MCTidwell, RR Novel bis(benzamidino) compounds with an aromatic central link. Inhibitors of thrombin, pancreatic kallikrein, trypsin, and complement. J Med Chem19:634-9 (1976) Prothrombin
Name:Prothrombin
Type:Enzyme
Mol. Mass.:70502.73
Organism:Bos taurus (Bovine)
Description:P00735
Residue:625
BDBM50016525
NameBDBM50016525
Synonyms:CHEMBL3277920
TypeSmall organic molecule
Emp. Form.C22H23ClN4O2
Mol. Mass.410.897
SMILESCl.NC(=N)c1ccc(OCc2cccc(COc3ccc(cc3)C(N)=N)c2)cc1