Reaction Details
TargetProthrombin
LigandBDBM50016529
Substrate/Competitorn/a
Meas. Tech.ChEMBL_1354674 (CHEMBL3281099)
Ki 5100±n/a nM
Citation Geratz, JDCheng, MCTidwell, RR Novel bis(benzamidino) compounds with an aromatic central link. Inhibitors of thrombin, pancreatic kallikrein, trypsin, and complement. J Med Chem19:634-9 (1976) Prothrombin
Name:Prothrombin
Type:Enzyme
Mol. Mass.:70502.73
Organism:Bos taurus (Bovine)
Description:P00735
Residue:625
BDBM50016529
NameBDBM50016529
Synonyms:CHEMBL3277926
TypeSmall organic molecule
Emp. Form.C26H25ClN4O2
Mol. Mass.460.955
SMILESCl.NC(=N)c1ccc(COc2cccc3c(OCc4ccc(cc4)C(N)=N)cccc23)cc1