Reaction Details
TargetProthrombin
LigandBDBM50016537
Substrate/Competitorn/a
Meas. Tech.ChEMBL_1354674 (CHEMBL3281099)
Ki 6600±n/a nM
Citation Geratz, JDCheng, MCTidwell, RR Novel bis(benzamidino) compounds with an aromatic central link. Inhibitors of thrombin, pancreatic kallikrein, trypsin, and complement. J Med Chem19:634-9 (1976) Prothrombin
Name:Prothrombin
Type:Enzyme
Mol. Mass.:70502.73
Organism:Bos taurus (Bovine)
Description:P00735
Residue:625
BDBM50016537
NameBDBM50016537
Synonyms:CHEMBL3277932
TypeSmall organic molecule
Emp. Form.C26H25ClN4O2
Mol. Mass.460.955
SMILESCl.NC(=N)c1ccc(OCc2ccc(COc3ccc(cc3)C(N)=N)c3ccccc23)cc1