Reaction Details
TargetProthrombin
LigandBDBM50016539
Substrate/Competitorn/a
Meas. Tech.ChEMBL_1354674 (CHEMBL3281099)
Ki 1670±n/a nM
Citation Geratz, JDCheng, MCTidwell, RR Novel bis(benzamidino) compounds with an aromatic central link. Inhibitors of thrombin, pancreatic kallikrein, trypsin, and complement. J Med Chem19:634-9 (1976) Prothrombin
Name:Prothrombin
Type:Enzyme
Mol. Mass.:70502.73
Organism:Bos taurus (Bovine)
Description:P00735
Residue:625
BDBM50016539
NameBDBM50016539
Synonyms:CHEMBL3277936
TypeSmall organic molecule
Emp. Form.C28H27ClN4O2
Mol. Mass.486.993
SMILESCl.NC(=N)c1cccc(OCc2cccc(c2)-c2cccc(COc3cccc(c3)C(N)=N)c2)c1