Reaction Details
TargetDNA-directed RNA polymerase subunit beta'
LigandBDBM50015214
Substrate/Competitorn/a
Meas. Tech.ChEMBL_1359536 (CHEMBL3281710)
IC50 20000±n/a nM
Citation Sinha, BKCysyk, RLMillar, DBChignell, CF Synthesis and biological properties of some spin-labeled 9-aminoacridines. J Med Chem19:994-8 (1976) DNA-directed RNA polymerase subunit beta'
Name:DNA-directed RNA polymerase subunit beta'
Type:PROTEIN
Mol. Mass.:155165.00
Organism:Escherichia coli K-12
Description:ChEMBL_106172
Residue:1407
BDBM50015214
NameBDBM50015214
Synonyms:6-chloro-2-methoxy-9-acridinyl(4-diethylamino-1-methylbutyl)amine CHEMBL7568 N*4*-(6-Chloro-2-methoxy-acridin-9-yl)-N*1*,N*1*-diethyl-pentane-1,4-diamine N*4*-(6-Chloro-2-methoxy-acridin-9-yl)-N*1*,N*1*-diethyl-pentane-1,4-diamine ; (mepacrine) cid_237 | quinacrine
TypeSmall organic molecule
Emp. Form.C23H30ClN3O
Mol. Mass.399.957
SMILESCCN(CC)CCCC(C)Nc1c2ccc(Cl)cc2nc2ccc(OC)cc12