Reaction Details
TargetXanthine dehydrogenase/oxidase
LigandBDBM50016707
Substrate/Competitorn/a
Meas. Tech.ChEMBL_1354804 (CHEMBL3279105)
Ki 18±n/a nM
Citation Springer, RHDimmitt, MKNovinson, TO'Brien, DERobins, RKSimon, LNMiller, JP Synthesis and enzymic activity of some novel xanthine oxidase inhibitors. 3-Substituted 5,7-dihydroxypyrazolo(1,5-alpha)pyrimidines. J Med Chem19:291-6 (1976) Xanthine dehydrogenase/oxidase
Name:Xanthine dehydrogenase/oxidase
Type:Protein
Mol. Mass.:146809.00
Organism:Bos taurus (Bovine)
Description:P80457
Residue:1332
BDBM50016707
NameBDBM50016707
Synonyms:CHEMBL3276846
TypeSmall organic molecule
Emp. Form.C13H9N3O4
Mol. Mass.271.2283
SMILESOc1cc(O)n2ncc(-c3ccc4OCOc4c3)c2n1