Reaction Details
TargetXanthine dehydrogenase/oxidase
LigandBDBM50016700
Substrate/Competitorn/a
Meas. Tech.ChEMBL_1354806 (CHEMBL3279107)
Ki 23±n/a nM
Citation Springer, RHDimmitt, MKNovinson, TO'Brien, DERobins, RKSimon, LNMiller, JP Synthesis and enzymic activity of some novel xanthine oxidase inhibitors. 3-Substituted 5,7-dihydroxypyrazolo(1,5-alpha)pyrimidines. J Med Chem19:291-6 (1976) Xanthine dehydrogenase/oxidase
Name:Xanthine dehydrogenase/oxidase
Type:Protein
Mol. Mass.:146809.00
Organism:Bos taurus (Bovine)
Description:P80457
Residue:1332
BDBM50016700
NameBDBM50016700
Synonyms:CHEMBL3276842
TypeSmall organic molecule
Emp. Form.C12H8ClN3O2
Mol. Mass.261.664
SMILESOc1cc(O)n2ncc(-c3ccc(Cl)cc3)c2n1