Reaction Details
TargetDihydrofolate reductase
LigandBDBM50016796
Substrate/Competitorn/a
Meas. Tech.ChEMBL_1357878 (CHEMBL3285765)
IC50 740±n/a nM
Citation Chaykovsky, MHirst, MLazarus, HMartinelli, JE Methotrexate analogues. 9. Synthesis and biological properties of some 8-alkyl-7,8-dihydro analogues. J Med Chem20:1323-7 (1977) Dihydrofolate reductase
Name:Dihydrofolate reductase
Type:PROTEIN
Mol. Mass.:18437.08
Organism:Lactobacillus casei
Description:ChEMBL_1357878
Residue:163
BDBM50016796
NameBDBM50016796
Synonyms:CHEMBL3273852
TypeSmall organic molecule
Emp. Form.C27H30N8O5
Mol. Mass.546.5777
SMILESCN(CC1=Nc2c(N)nc(N)nc2N(Cc2ccccc2)C1)c1ccc(cc1)C(=O)N[C@@H](CCC(O)=O)C(O)=O