Reaction Details
TargetDihydrofolate reductase
LigandBDBM50016803
Substrate/Competitorn/a
Meas. Tech.ChEMBL_1357878 (CHEMBL3285765)
IC50 2500±n/a nM
Citation Chaykovsky, MHirst, MLazarus, HMartinelli, JE Methotrexate analogues. 9. Synthesis and biological properties of some 8-alkyl-7,8-dihydro analogues. J Med Chem20:1323-7 (1977) Dihydrofolate reductase
Name:Dihydrofolate reductase
Type:PROTEIN
Mol. Mass.:18437.08
Organism:Lactobacillus casei
Description:ChEMBL_1357878
Residue:163
BDBM50016803
NameBDBM50016803
Synonyms:CHEMBL3274179
TypeSmall organic molecule
Emp. Form.C21H28N8O5
Mol. Mass.472.4976
SMILESCN(CC1CN(C)c2nc(N)nc(N)c2N1)c1ccc(cc1)C(=O)N[C@@H](CCC(O)=O)C(O)=O