Reaction Details
TargetAcetylcholinesterase
LigandBDBM50016809
Substrate/Competitorn/a
Meas. Tech.ChEMBL_1360667 (CHEMBL3282825)
pH8.25±n/a
Ki 10000000±n/a nM
Commentsextracted
Citation Alspach, JDIngraham, LL Inhibition of acetylcholinesterase by thiamine. A structure-function study. J Med Chem20:161-4 (1977) Acetylcholinesterase
Name:Acetylcholinesterase
Type:Enzyme
Mol. Mass.:71812.79
Organism:Electrophorus electricus (Electric eel)
Description:n/a
Residue:633
BDBM50016809
NameBDBM50016809
Synonyms:CHEMBL3275133
TypeSmall organic molecule
Emp. Form.C12H20ClN4O10P3S
Mol. Mass.540.747
SMILES[Cl-].Cc1c(CCOP(O)(=O)OP(O)(=O)OP(O)(O)=O)sc[n+]1Cc1cnc(C)nc1N