Reaction Details
TargetAcetylcholinesterase
LigandBDBM50373877
Substrate/Competitorn/a
Meas. Tech.ChEMBL_1360666 (CHEMBL3282824)
pH7±n/a
Ki 570000±n/a nM
Commentsextracted
Citation Alspach, JDIngraham, LL Inhibition of acetylcholinesterase by thiamine. A structure-function study. J Med Chem20:161-4 (1977) Acetylcholinesterase
Name:Acetylcholinesterase
Type:Enzyme
Mol. Mass.:71812.79
Organism:Electrophorus electricus (Electric eel)
Description:n/a
Residue:633
BDBM50373877
NameBDBM50373877
Synonyms:Betaxin THIAMINE (VIT B1) Thiamine | Vitamin B 1
TypeSmall organic molecule
Emp. Form.C12H17N4OS
Mol. Mass.265.354
SMILESCc1c(CCO)sc[n+]1Cc1cnc(C)nc1N