Reaction Details
TargetHistone deacetylase 1
LigandBDBM50016946
Substrate/Competitorn/a
Meas. Tech.ChEMBL_1362738 (CHEMBL3294937)
IC50 18±n/a nM
Citation Methot, JLHoffman, DMWitter, DJStanton, MGHarrington, PHamblett, CSiliphaivanh, PWilson, KHubbs, JHeidebrecht, RKral, AMOzerova, NFleming, JCWang, HSzewczak, AAMiddleton, REHughes, BCruz, JCHaines, BBChenard, MKenific, CMHarsch, ASecrist, JPMiller, TA Delayed and Prolonged Histone Hyperacetylation with a Selective HDAC1/HDAC2 Inhibitor. ACS Med Chem Lett5:340-5 (2014) 
 
Histone deacetylase 1
Name:Histone deacetylase 1
Type:Enzyme
Mol. Mass.:55090.27
Organism:Homo sapiens (Human)
Description:Q13547
Residue:482
BDBM50016946
NameBDBM50016946
Synonyms:CHEMBL3286737
TypeSmall organic molecule
Emp. Form.C23H25N7O3
Mol. Mass.447.4897
SMILESCn1cc(cn1)-c1ccc(N)c(NC(=O)c2ccc(nc2)N2CCC3(CNC(=O)O3)CC2)c1