Reaction Details
TargetPotassium voltage-gated channel subfamily H member 2
LigandBDBM50016948
Substrate/Competitorn/a
Meas. Tech.ChEMBL_1363116 (CHEMBL3293609)
Ki>10000±n/a nM
Citation Methot, JLHoffman, DMWitter, DJStanton, MGHarrington, PHamblett, CSiliphaivanh, PWilson, KHubbs, JHeidebrecht, RKral, AMOzerova, NFleming, JCWang, HSzewczak, AAMiddleton, REHughes, BCruz, JCHaines, BBChenard, MKenific, CMHarsch, ASecrist, JPMiller, TA Delayed and Prolonged Histone Hyperacetylation with a Selective HDAC1/HDAC2 Inhibitor. ACS Med Chem Lett5:340-5 (2014) 
 
Potassium voltage-gated channel subfamily H member 2
Name:Potassium voltage-gated channel subfamily H member 2
Type:Multi-pass membrane protein
Mol. Mass.:126672.65
Organism:Homo sapiens (Human)
Description:Q12809
Residue:1159
BDBM50016948
NameBDBM50016948
Synonyms:CHEMBL3286739
TypeSmall organic molecule
Emp. Form.C19H21N5O3
Mol. Mass.367.4017
SMILESNc1ccccc1NC(=O)c1ccc(nc1)N1CCC2(CNC(=O)O2)CC1