Reaction Details
TargetProstaglandin E2 receptor EP2 subtype
LigandBDBM85184
Substrate/Competitorn/a
Meas. Tech.ChEMBL_1364732 (CHEMBL3293993)
Ki 1150±n/a nM
Citation Ganesh, T Prostanoid receptor EP2 as a therapeutic target. J Med Chem57:4454-65 (2014) 
 
Prostaglandin E2 receptor EP2 subtype
Name:Prostaglandin E2 receptor EP2 subtype
Type:Enzyme
Mol. Mass.:39775.71
Organism:Homo sapiens (Human)
Description:P43116
Residue:358
BDBM85184
NameBDBM85184
Synonyms:AH-6809 NSC_119461
TypeSmall organic molecule
Emp. Form.C17H14O5
Mol. Mass.298.2901
SMILESCC(C)Oc1ccc2c(c1)oc1ccc(cc1c2=O)C(O)=O