Reaction Details
TargetProstacyclin receptor
LigandBDBM85602
Substrate/Competitorn/a
Meas. Tech.ChEMBL_1364381 (CHEMBL3294250)
IC50 37±n/a nM
Citation Ganesh, T Prostanoid receptor EP2 as a therapeutic target. J Med Chem57:4454-65 (2014) 
 
Prostacyclin receptor
Name:Prostacyclin receptor
Type:G Protein-Coupled Receptor (GPCR)
Mol. Mass.:40968.22
Organism:Homo sapiens (Human)
Description:The membranes prepared from human platelet were used in binding assay.
Residue:386
BDBM85602
NameBDBM85602
Synonyms:(R)-BUTAPROST CAS_69648-38-0
TypeSmall organic molecule
Emp. Form.C24H40O5
Mol. Mass.408.5714
SMILESCCCC1(CCC1)[C@H](O)C\C=C\[C@H]1[C@H](O)CC(=O)[C@@H]1CCCCCCC(=O)OC