Reaction Details
Target11-beta-hydroxysteroid dehydrogenase 1
LigandBDBM50016983
Substrate/Competitorn/a
Meas. Tech.ChEMBL_1364761 (CHEMBL3294022)
IC50 6.0±n/a nM
Citation Scott, JSGoldberg, FWTurnbull, AV Medicinal chemistry of inhibitors of 11ß-hydroxysteroid dehydrogenase type 1 (11ß-HSD1). J Med Chem57:4466-86 (2014) 
 
11-beta-hydroxysteroid dehydrogenase 1
Name:11-beta-hydroxysteroid dehydrogenase 1
Type:Enzyme
Mol. Mass.:32409.16
Organism:Homo sapiens (Human)
Description:P28845
Residue:292
BDBM50016983
NameBDBM50016983
Synonyms:CHEMBL3220543
TypeSmall organic molecule
Emp. Form.C23H29N3O3S
Mol. Mass.427.56
SMILES[H][C@@]12CN(C[C@]1([H])[C@H]2C(O)=O)c1ccc(C(=O)NC23CC4CC(CC(C4)C2)C3)c(SC)n1