Reaction Details
TargetP2Y purinoceptor 2
LigandBDBM50015276
Substrate/Competitorn/a
Meas. Tech.ChEMBL_1365178 (CHEMBL3292928)
IC50>10000±n/a nM
Citation Jeon, YTYang, WQiao, JXLi, LRuel, RThibeault, CHiebert, SWang, TCWang, YLiu, YClark, CGWong, HSZhu, JWu, DRSun, DChen, BCMathur, AChacko, SAMalley, MChen, XQShen, HHuang, CSSchumacher, WABostwick, JSStewart, ABPrice, LAHua, JLi, DLevesque, PCSeiffert, DARehfuss, RWexler, RRLam, PY Identification of 1-{2-[4-chloro-1'-(2,2-dimethylpropyl)-7-hydroxy-1,2-dihydrospiro[indole-3,4'-piperidine]-1-yl]phenyl}-3-{5-chloro-[1,3]thiazolo[5,4-b]pyridin-2-yl}urea, a potent, efficacious and orally bioavailable P2Y(1) antagonist as an antiplatelet agent. Bioorg Med Chem Lett24:1294-8 (2014) 
 
P2Y purinoceptor 2
Name:P2Y purinoceptor 2
Type:PROTEIN
Mol. Mass.:42299.21
Organism:Homo sapiens (Human)
Description:ChEMBL_1455361
Residue:377
BDBM50015276
NameBDBM50015276
Synonyms:CHEMBL3263056 US9428504, 167
TypeSmall organic molecule
Emp. Form.C30H32Cl2N6O2S
Mol. Mass.611.585
SMILESCC(C)(C)CN1CCC2(CN(c3c2c(Cl)ccc3O)c2ccccc2NC(=O)Nc2nc3ccc(Cl)nc3s2)CC1