Reaction Details
TargetMelanocyte-stimulating hormone receptor
LigandBDBM50017134
Substrate/Competitorn/a
Meas. Tech.ChEMBL_1365585 (CHEMBL3297366)
EC50 19±n/a nM
Citation Haslach, EMHuang, HDirain, MDebevec, GGeer, PSantos, RGGiulianotti, MAPinilla, CAppel, JRDoering, SRWalters, MAHoughten, RAHaskell-Luevano, C Identification of tetrapeptides from a mixture based positional scanning library that can restore nM full agonist function of the L106P, I69T, I102S, A219V, C271Y, and C271R human melanocortin-4 polymorphic receptors (hMC4Rs). J Med Chem57:4615-28 (2014) 
 
Melanocyte-stimulating hormone receptor
Name:Melanocyte-stimulating hormone receptor
Type:PROTEIN
Mol. Mass.:35238.60
Organism:Mus musculus
Description:ChEMBL_1498846
Residue:315
BDBM50017134
NameBDBM50017134
Synonyms:CHEMBL3287327
TypeSmall organic molecule
Emp. Form.C32H40ClIN10O5
Mol. Mass.807.081
SMILESCC(=O)N[C@@H](Cc1cnc[nH]1)C(=O)N[C@H](Cc1ccc(Cl)cc1)C(=O)N[C@@H](CCCNC(N)=N)C(=O)N[C@@H](Cc1ccc(I)cc1)C(N)=O